Home > Cannot Find > Maven Compilation Error Cannot Find Symbol

Maven Compilation Error Cannot Find Symbol

Contents

Lesson: Don't define your own classes with the same names as common library classes! The point is that you need to understand what your code is trying to do in order to find the right fix. 4. See this page for more information. Comment 7 Jaroslav Pospisil 2007-04-27 08:17:52 UTC Verified in 200704261200 Comment 8 _ rkubacki 2007-04-27 13:01:53 UTC This is fixed but I can't find in what build - can you set http://vootext.com/cannot-find/maven-compilation-failure-cannot-find-symbol.html

Advanced Search Forum Java Programming Java Programming [RESOLVED] Cannot find symbol class If this is your first visit, be sure to check out the FAQ by clicking the link above. generating code... Posting code? Is "The empty set is a subset of any set" a convention? https://netbeans.org/bugzilla/show_bug.cgi?id=102436

Maven Compilation Error Cannot Find Symbol

Its fixed and verified in JAX-WS 2.1.2 RI. which is in java.nio not java.io. SUCCESS [1:10.655s] [INFO] CMDBuild Web Service Client ....................... Error: [INFO] Compiling 137 source files to V:\dhs_tss_build_view\dhs_tssproject\tss\tsscommon-server\target\classes [INFO] ------------------------------------------------------------------------ [ERROR] BUILD FAILURE [INFO] ------------------------------------------------------------------------ [INFO] Compilation failure V:/dhs_tss_build_view/dhs_tssproject/tss/tsscommon-server/src/main/java/us/mn/state/dhs/tss/common/oblix/da/wsdl/OblixLoginAc cess.java:[51,60] cannot find symbol symbol : class BusinessException location: class us.mn.state.dhs.tss.common.oblix.da.wsdl.OblixLoginAccess V:/dhs_tss_build_view/dhs_tssproject/tss/tsscommon-server/src/main/java/us/mn/state/dhs/tss/common/app/da/ldap/BaseLdapImpl.j

This did not help me resolve it, but was very informative. –Phillip Scott Givens Apr 1 '13 at 6:58 add a comment| up vote 2 down vote i have an error The changes are limited to the res-maven-plugin section and . currently you use fuse repository and fuse version in your patch, since this patch will go into apache code base, when shouldn't use fuse related stuff here. Maven Compile Error Symbol Not Found Obscure causes Here are a couple of cases where the "Cannot find symbol" is seemingly inexplicable ...

If, for example, you made changes to modules A, B, and C, but then you try to compile just module B, you are susceptible to this error. Show vivekp added a comment - 25/Apr/07 5:53 PM This bug appears only when wsimport's -Xendorsed or equivalent ant option xendorsed is used and the Glassfish or NB 6 is installed asked 2 years ago viewed 266181 times active 7 days ago Get the weekly newsletter! Comment 5 Petr Blaha 2007-04-26 17:02:52 UTC This is same root cause as in issue #100718.

when i did debug using -X i have seennthe dependency directing the right path toward the jar though it is not recogniseing it –dagg Oct 19 '09 at 15:59 Cannot Find Symbol Class Hide Permalink Freeman Fang added a comment - 18/Nov/08 06:50 patch applied on befalf of Ashwin with thanks http://svn.apache.org/viewvc?rev=718506&view=rev Show Freeman Fang added a comment - 18/Nov/08 06:50 patch applied on Dungeons in a 3d space game Polite way to ride in the dark Was Donald Trump's father a member of the KKK? which caused issues).

Maven Cannot Find Symbol Dependency

Changing the 'scope' solved the issue for me. Go Here mvn hg clone https://bitbucket.org/tecnoteca/cmdbuild cd cmdbuild/cmdbuild-graph mvn install cd .. Maven Compilation Error Cannot Find Symbol The reason was that I wasn't using the correct folder structure for mvn: "src/main/java/com" etc. Maven Compilation Error Package Does Not Exist This could be an IDE bug.

I was getting the following error: error: cannot find symbol Solution: I resolved this by first compiling the package where the method is defined then the package where the method was http://vootext.com/cannot-find/cannot-find-symbol-error-symbol-method-assertequalsjava-lang-string-java-lang-string.html This command is invoked: command line: wsimport -d "C:\Documents and Settings\Telco\My Documents\NetBeansProjects\WebApplication4\build\generated\wsimport\binaries" -extension -keep -s "C:\Documents and Settings\Telco\My Documents\NetBeansProjects\WebApplication4\build\generated\wsimport\client" -catalog "C:\Documents and Settings\Telco\My Documents\NetBeansProjects\WebApplication4\catalog.xml" -verbose "C:\Documents and Settings\Telco\My Documents\NetBeansProjects\WebApplication4/src/conf/xml-resources/web-service-references/NewWebServiceService/wsdl/localhost_8080/WebApplication3/NewWebServiceService.wsdl" -p wsc Tenant paid rent in cash and it was stolen from a mailbox. I have also checked and verified the maven script and it is perfect. Maven Test Compile Cannot Find Symbol

SUCCESS [3.537s] [INFO] CMDBuild DMS Alfresco ............................. Can you post all the code and/or show how you are compiling the classes and running the app Code: //code for SimpleDotCom package dotGame; public class SimpleDotCom { int [] locationCells share|improve this answer answered Apr 12 at 3:03 Vibha 9115 add a comment| Your Answer draft saved draft discarded Sign up or log in Sign up using Google Sign up click site wsc\ObjectFactory.java wsc\Search.java wsc\SearchResponse.java wsc\WebSearchWS.java wsc\WebSearchWSSoap.java wsc\package-info.java C:\Documents and Settings\Telco\My Documents\NetBeansProjects\WebApplication5\build\generated\wsimport\client\wsc\WebSearchWS.java:10: cannot find symbol symbol : class WebServiceFeature location: package javax.xml.ws import javax.xml.ws.WebServiceFeature; C:\Documents and Settings\Telco\My Documents\NetBeansProjects\WebApplication5\build\generated\wsimport\client\wsc\WebSearchWSSoap.java:8: cannot find symbol symbol :

Fitzgerald 69049 add a comment| Your Answer draft saved draft discarded Sign up or log in Sign up using Google Sign up using Facebook Sign up using Email and Password Cannot Find Symbol Method There are some other more obscure causes too ... Join them; it only takes a minute: Sign up maven compilation failure up vote 17 down vote favorite 10 I have a weird problem - Some class file couldn't be read

Cheers, Ashwin...

Browse other questions tagged java compiler-errors cannot-find-symbol or ask your own question. Could you please review and commit this fixed version as appropriate. SUCCESS [8.705s] [INFO] CMDBuild Shark Commons ............................ Maven Cannot Find Symbol Method The maven-compiler-plugin is configured to handle this as below: org.apache.maven.plugins maven-compiler-plugin core/** gen/** 1.5 1.5 Cause Clover does not understand the above definition of source

Are the other wizard arcane traditions not part of the SRD? stringBuilder instead of StringBuilder. How can I gradually encrypt a file that is being downloaded?' How to copy from current line to the `n`-th line? http://vootext.com/cannot-find/maven-compile-failure-cannot-find-symbol.html I've seen this kind of error after "optimizing" code like this: if(somethingIsTrue()) { String message = "Everything is fine"; System.out.println(message); } else { String message = "We have an error"; System.out.println(message);

To start viewing messages, select the forum that you want to visit from the selection below. This question is designed to be a comprehensive question about "cannot find symbol" compilation errors in Java. Topology and the 2016 Nobel Prize in Physics Safety of using images found through Google image search How do I debug an emoticon-based URL? As a first order, there is only one cause.

But you'd be wrong. Perhaps you used underscores inappropriately; i.e. For example, maybe you "star" imported java.io.* and then tried to use the Files class ... A Thing, made of things, which makes many things My math students consider me a harsh grader.

FAILURE [23.310s] [INFO] CMDBuild Shark Legacy Extensions ..................